{"text_format":"1","workbook":"xlsx","n_sheets":11,"sheets":["OPNA","Adstod","Forsendur","Rekstur","Fyrningar","Lan","Efnahagur","Arsreikningur","Naemi","Verdmat","Myndir"],"not_rendered":{"charts":3,"images":6,"macros":1,"external_links":1,"defined_names":36,"comments":4,"pivot_tables":0},"unopened":[],"bounds":{"document_bytes":16777216,"sheet_cells":100000,"rows_first":2000,"rows_last":500,"rows_between":2000,"halvings":0,"cell_chars":16384,"cell_head_chars":4096},"cells_cut":0,"cells_raw":0,"read":"whole","date_system":"1900"}

{"sheet":"OPNA","index":0,"n_rows":12,"n_cols":3,"rows_kept":12,"cut":false,"hidden":false,"merged":[[1,1,3,8],[5,1,7,8],[9,1,9,8],[11,2,13,8],[10,2,10,8]]}
[]
[null,"Þetta líkan er eign Byggðastofnunar, gert af CAPACENT, og er öllum frjálst til afnota við gerð rekstrar- og viðskiptaáætlana."]
[]
[]
[]
[null,"Viðskiptavinir Byggðastofnunar eru hvattir til að nýta sér möguleika líkansins, en líkanið býður upp á rekstraráætlun til fimm ára, þróun efnahagsreiknings, áætlað sjóðstreymi, næmisgreiningu sem og verðmat."]
[]
[]
[]
[null,"Með notkun á forritinu samþykkir þú eftirfarandi:"]
{"$rows_left_out":3}
{"sheet":"Adstod","index":1,"n_rows":382,"n_cols":2,"rows_kept":382,"cut":false,"hidden":false,"merged":[]}
[{"$f":"Forsendur!$C$5","v":"Nafn fyrirtækis"}]
[]
[]
["Almennar upplýsingar"]
[]
[]
[]
[]
[]
[]
{"$rows_left_out":373}
{"sheet":"Forsendur","index":2,"n_rows":109,"n_cols":4,"rows_kept":109,"cut":false,"hidden":false,"merged":[[8,0,8,2],[49,0,49,2],[92,0,92,1],[103,0,103,1]]}
[{"$f":"$C$5","v":"Nafn fyrirtækis"}]
[]
["Gunnforsendur"]
[]
[null,"Fyrirtæki","Nafn fyrirtækis"]
[null,"Upphafsár áætlunar",2016]
[null,"Númer fyrsta mánaðar ársins",1]
[]
["REKSTRARREIKNINGUR - OPNUNARSTAÐA"]
[null,null,"Skýr.",{"$f":"IF(Forsendur!$C$7=1,\"Árið\n\"&Forsendur!$C$6-1,\"Árið\n\"&Forsendur!$C$6-1&\"-\"&Forsendur!$C$6)","v":"Árið\n2015"}]
{"$rows_left_out":100}
{"sheet":"Rekstur","index":3,"n_rows":120,"n_cols":34,"rows_kept":120,"cut":false,"hidden":false,"merged":[[91,1,91,2],[99,1,99,2],[107,1,107,2],[6,1,6,2],[20,1,20,2],[34,1,34,2],[48,1,48,2],[66,1,66,2],[75,1,75,2]]}
[{"$f":"Forsendur!$C$5","v":"Nafn fyrirtækis"}]
[]
[null,null,"Skýr.",null,null,{"$f":"Efnahagur!H3","v":"Jan\n2016"},{"$f":"Efnahagur!I3","v":"Feb\n2016"},{"$f":"Efnahagur!J3","v":"Mar\n2016"},{"$f":"Efnahagur!K3","v":"Apr\n2016"},{"$f":"Efnahagur!L3","v":"Maí\n2016"},{"$f":"Efnahagur!M3","v":"Jún\n2016"},{"$f":"Efnahagur!N3","v":"Júl\n2016"},{"$f":"Efnahagur!O3","v":"Ágú\n2016"},{"$f":"Efnahagur!P3","v":"Sep\n2016"},{"$f":"Efnahagur!Q3","v":"Okt\n2016"},{"$f":"Efnahagur!R3","v":"Nóv\n2016"},{"$f":"Efnahagur!S3","v":"Des\n2016"},{"$f":"Efnahagur!T3","v":"Árið\n2016"},{"$f":"Efnahagur!U3","v":"Jan\n2017"},{"$f":"Efnahagur!V3","v":"Feb\n2017"},{"$f":"Efnahagur!W3","v":"Mar\n2017"},{"$f":"Efnahagur!X3","v":"Apr\n2017"},{"$f":"Efnahagur!Y3","v":"Maí\n2017"},{"$f":"Efnahagur!Z3","v":"Jún\n2017"},{"$f":"Efnahagur!AA3","v":"Júl\n2017"},{"$f":"Efnahagur!AB3","v":"Ágú\n2017"},{"$f":"Efnahagur!AC3","v":"Sep\n2017"},{"$f":"Efnahagur!AD3","v":"Okt\n2017"},{"$f":"Efnahagur!AE3","v":"Nóv\n2017"},{"$f":"Efnahagur!AF3","v":"Des\n2017"},{"$f":"Efnahagur!AG3","v":"Árið\n2017"},{"$f":"Efnahagur!AH3","v":"Árið\n2018"},{"$f":"Efnahagur!AI3","v":"Árið\n2019"},{"$f":"Efnahagur!AJ3","v":"Árið\n2020"}]
[null,"Vegna vaxtar í launum",null,null,null,1,{"$f":"F4+1","v":2},{"$f":"G4+1","v":3},4,5,6,7,8,9,10,11,12,null,{"$f":"Q4+1","v":13},14,15,16,17,18,19,20,21,22,23,24,null,3,4,5]
["TEKJUR"]
[]
[null,"Tekjuliður no 1"]
[]
[null,"Fjöldi eininga"]
[null,"Liður 1",null,null,null,null,null,null,null,null,null,null,null,null,null,null,null,{"$f":"SUM(F10:Q10)","v":0},null,null,null,null,null,null,null,null,null,null,null,null,{"$f":"SUM(S10:AD10)","v":0}]
{"$rows_left_out":111}
{"sheet":"Fyrningar","index":4,"n_rows":53,"n_cols":38,"rows_kept":53,"cut":false,"hidden":false,"merged":[[44,0,44,1],[4,0,4,1],[14,0,14,1],[24,0,24,1],[34,0,34,1]]}
[{"$f":"+Forsendur!$C$5","v":"Nafn fyrirtækis"}]
[]
[null,null,"Afskrifta\n% pr. ár","Niðurlags-\nhlutfall","Fyrninga-\nflokkur","Fyrning reiknuð út frá","Skýr.",null,{"$f":"+Efnahagur!G3","v":"Árið\n2015"},{"$f":"+Efnahagur!H3","v":"Jan\n2016"},{"$f":"+Efnahagur!I3","v":"Feb\n2016"},{"$f":"+Efnahagur!J3","v":"Mar\n2016"},{"$f":"+Efnahagur!K3","v":"Apr\n2016"},{"$f":"+Efnahagur!L3","v":"Maí\n2016"},{"$f":"+Efnahagur!M3","v":"Jún\n2016"},{"$f":"+Efnahagur!N3","v":"Júl\n2016"},{"$f":"+Efnahagur!O3","v":"Ágú\n2016"},{"$f":"+Efnahagur!P3","v":"Sep\n2016"},{"$f":"+Efnahagur!Q3","v":"Okt\n2016"},{"$f":"+Efnahagur!R3","v":"Nóv\n2016"},{"$f":"+Efnahagur!S3","v":"Des\n2016"},{"$f":"+Efnahagur!T3","v":"Árið\n2016"},{"$f":"+Efnahagur!U3","v":"Jan\n2017"},{"$f":"+Efnahagur!V3","v":"Feb\n2017"},{"$f":"+Efnahagur!W3","v":"Mar\n2017"},{"$f":"+Efnahagur!X3","v":"Apr\n2017"},{"$f":"+Efnahagur!Y3","v":"Maí\n2017"},{"$f":"+Efnahagur!Z3","v":"Jún\n2017"},{"$f":"+Efnahagur!AA3","v":"Júl\n2017"},{"$f":"+Efnahagur!AB3","v":"Ágú\n2017"},{"$f":"+Efnahagur!AC3","v":"Sep\n2017"},{"$f":"+Efnahagur!AD3","v":"Okt\n2017"},{"$f":"+Efnahagur!AE3","v":"Nóv\n2017"},{"$f":"+Efnahagur!AF3","v":"Des\n2017"},{"$f":"+Efnahagur!AG3","v":"Árið\n2017"},{"$f":"+Efnahagur!AH3","v":"Árið\n2018"},{"$f":"+Efnahagur!AI3","v":"Árið\n2019"},{"$f":"+Efnahagur!AJ3","v":"Árið\n2020"}]
[]
["Skrifið inn heiti á eign / eignarflokki hér"]
[]
[null,"Grunnforsendur",0,0.1,"Fyrningaflokkur 1","Stofnverðmæti",{"$f":"INDEX(Forsendur!$C$99:$C$102,MATCH($E7,Fyrningaflokkur,0))","v":16}]
[null,"Keyptar eignir",null,null,null,null,{"$f":"G7&\"_2\"","v":"16_2"},null,null,null,null,null,null,null,null,null,null,null,null,null,null,{"$f":"SUM(J8:U8)","v":0},null,null,null,null,null,null,null,null,null,null,null,null,{"$f":"SUM(W8:AH8)","v":0}]
[null,"Seldar eignir",null,null,null,null,{"$f":"G7&\"_3\"","v":"16_3"},null,null,null,null,null,null,null,null,null,null,null,null,null,null,{"$f":"SUM(J9:U9)","v":0},null,null,null,null,null,null,null,null,null,null,null,null,{"$f":"SUM(W9:AH9)","v":0}]
[null,"Stofnverð",null,null,null,null,{"$f":"G7&\"_4\"","v":"16_4"},null,null,{"$f":"+IF(SUM($I9:I9)<>0,0,IF(J9<>0,0,I10+J8-J9))","v":0},{"$f":"+IF(SUM($I9:J9)<>0,0,IF(K9<>0,0,J10+K8-K9))","v":0},{"$f":"+IF(SUM($I9:K9)<>0,0,IF(L9<>0,0,K10+L8-L9))","v":0},{"$f":"+IF(SUM($I9:L9)<>0,0,IF(M9<>0,0,L10+M8-M9))","v":0},{"$f":"+IF(SUM($I9:M9)<>0,0,IF(N9<>0,0,M10+N8-N9))","v":0},{"$f":"+IF(SUM($I9:N9)<>0,0,IF(O9<>0,0,N10+O8-O9))","v":0},{"$f":"+IF(SUM($I9:O9)<>0,0,IF(P9<>0,0,O10+P8-P9))","v":0},{"$f":"+IF(SUM($I9:P9)<>0,0,IF(Q9<>0,0,P10+Q8-Q9))","v":0},{"$f":"+IF(SUM($I9:Q9)<>0,0,IF(R9<>0,0,Q10+R8-R9))","v":0},{"$f":"+IF(SUM($I9:R9)<>0,0,IF(S9<>0,0,R10+S8-S9))","v":0},{"$f":"+IF(SUM($I9:S9)<>0,0,IF(T9<>0,0,S10+T8-T9))","v":0},{"$f":"+IF(SUM($I9:T9)<>0,0,IF(U9<>0,0,T10+U8-U9))","v":0},{"$f":"+U10","v":0},{"$f":"+IF(SUM($I9:V9)<>0,0,IF(W9<>0,0,V10+W8-W9))","v":0},{"$f":"+IF(SUM($I9:W9)<>0,0,IF(X9<>0,0,W10+X8-X9))","v":0},{"$f":"+IF(SUM($I9:X9)<>0,0,IF(Y9<>0,0,X10+Y8-Y9))","v":0},{"$f":"+IF(SUM($I9:Y9)<>0,0,IF(Z9<>0,0,Y10+Z8-Z9))","v":0},{"$f":"+IF(SUM($I9:Z9)<>0,0,IF(AA9<>0,0,Z10+AA8-AA9))","v":0},{"$f":"+IF(SUM($I9:AA9)<>0,0,IF(AB9<>0,0,AA10+AB8-AB9))","v":0},{"$f":"+IF(SUM($I9:AB9)<>0,0,IF(AC9<>0,0,AB10+AC8-AC9))","v":0},{"$f":"+IF(SUM($I9:AC9)<>0,0,IF(AD9<>0,0,AC10+AD8-AD9))","v":0},{"$f":"+IF(SUM($I9:AD9)<>0,0,IF(AE9<>0,0,AD10+AE8-AE9))","v":0},{"$f":"+IF(SUM($I9:AE9)<>0,0,IF(AF9<>0,0,AE10+AF8-AF9))","v":0},{"$f":"+IF(SUM($I9:AF9)<>0,0,IF(AG9<>0,0,AF10+AG8-AG9))","v":0},{"$f":"+IF(SUM($I9:AG9)<>0,0,IF(AH9<>0,0,AG10+AH8-AH9))","v":0},{"$f":"+AH10","v":0},{"$f":"+IF(SUM($I9:AI9)<>0,0,IF(AJ9<>0,0,AI10+AJ8-AJ9))","v":0},{"$f":"+IF(SUM($I9:AJ9)<>0,0,IF(AK9<>0,0,AJ10+AK8-AK9))","v":0},{"$f":"+IF(SUM($I9:AK9)<>0,0,IF(AL9<>0,0,AK10+AL8-AL9))","v":0}]
{"$rows_left_out":44}
{"sheet":"Lan","index":5,"n_rows":76,"n_cols":39,"rows_kept":76,"cut":false,"hidden":false,"merged":[[5,0,5,1],[23,0,23,1],[41,0,41,1],[59,0,59,1]]}
[{"$f":"+Forsendur!$C$5","v":"Nafn fyrirtækis"}]
[]
[null,null,"Lánaflokkur","Fjöldi \nafborgana","Fjöldi afb.\ná heilum árum","Vextir\np.a.","Skýr",null,{"$f":"+Efnahagur!G3","v":"Árið\n2015"},{"$f":"+Efnahagur!H3","v":"Jan\n2016"},{"$f":"+Efnahagur!I3","v":"Feb\n2016"},{"$f":"+Efnahagur!J3","v":"Mar\n2016"},{"$f":"+Efnahagur!K3","v":"Apr\n2016"},{"$f":"+Efnahagur!L3","v":"Maí\n2016"},{"$f":"+Efnahagur!M3","v":"Jún\n2016"},{"$f":"+Efnahagur!N3","v":"Júl\n2016"},{"$f":"+Efnahagur!O3","v":"Ágú\n2016"},{"$f":"+Efnahagur!P3","v":"Sep\n2016"},{"$f":"+Efnahagur!Q3","v":"Okt\n2016"},{"$f":"+Efnahagur!R3","v":"Nóv\n2016"},{"$f":"+Efnahagur!S3","v":"Des\n2016"},{"$f":"+Efnahagur!T3","v":"Árið\n2016"},{"$f":"+Efnahagur!U3","v":"Jan\n2017"},{"$f":"+Efnahagur!V3","v":"Feb\n2017"},{"$f":"+Efnahagur!W3","v":"Mar\n2017"},{"$f":"+Efnahagur!X3","v":"Apr\n2017"},{"$f":"+Efnahagur!Y3","v":"Maí\n2017"},{"$f":"+Efnahagur!Z3","v":"Jún\n2017"},{"$f":"+Efnahagur!AA3","v":"Júl\n2017"},{"$f":"+Efnahagur!AB3","v":"Ágú\n2017"},{"$f":"+Efnahagur!AC3","v":"Sep\n2017"},{"$f":"+Efnahagur!AD3","v":"Okt\n2017"},{"$f":"+Efnahagur!AE3","v":"Nóv\n2017"},{"$f":"+Efnahagur!AF3","v":"Des\n2017"},{"$f":"+Efnahagur!AG3","v":"Árið\n2017"},{"$f":"+Efnahagur!AH3","v":"Árið\n2018"},{"$f":"+Efnahagur!AI3","v":"Árið\n2019"},{"$f":"+Efnahagur!AJ3","v":"Árið\n2020"},{"$f":"+Efnahagur!AK3","v":"Árið\n2021"}]
[]
["Notað í lánaútreikningi - ekki eyða",null,null,null,null,null,null,null,null,null,null,null,null,null,null,null,null,null,null,null,null,null,null,null,null,null,null,null,null,null,null,null,null,null,null,1,1,1,1]
["Skrifið inn heiti á láni / lánaflokki hér"]
[]
[null,"Grunnforsendur","Lánaflokkur 1",0,12,0,{"$f":"INDEX(Forsendur!$C$107:$C$109,MATCH($C8,Lanaflokkur,0))","v":25}]
[null,"Ný lán",null,null,null,null,{"$f":"G8&\"_1\"","v":"25_1"},null,null,null,null,null,null,null,null,null,null,null,null,null,null,{"$f":"SUM(J9:U9)","v":0},null,null,null,null,null,null,null,null,null,null,null,null,{"$f":"SUM(W9:AH9)","v":0}]
[]
{"$rows_left_out":67}
{"sheet":"Efnahagur","index":6,"n_rows":133,"n_cols":37,"rows_kept":133,"cut":false,"hidden":false,"merged":[[6,0,6,1],[11,0,11,1],[17,0,17,1],[24,0,24,1],[30,0,30,1],[77,0,77,1],[82,0,82,1],[94,0,94,1],[116,0,116,1],[37,0,37,1],[42,0,42,1],[52,0,52,1],[57,0,57,1],[63,0,63,1],[70,0,70,1]]}
[{"$f":"Forsendur!$C$5","v":"Nafn fyrirtækis"}]
[]
[null,null,null,null,"Skýr.",null,{"$f":"IF(Forsendur!$C$7=1,\"Árið\n\"&Forsendur!$C$6-1,\"Árið\n\"&Forsendur!$C$6-1&\"-\"&Forsendur!$C$6)","v":"Árið\n2015"},{"$f":"PROPER(TEXT(DATE(Forsendur!$C$6,Forsendur!$C$7,1),\"Mmm\nyyy\"))","v":"Jan\n2016"},{"$f":"PROPER(TEXT(DATE(Forsendur!$C$6,Forsendur!$C$7+1,1),\"Mmm\nyyy\"))","v":"Feb\n2016"},{"$f":"PROPER(TEXT(DATE(Forsendur!$C$6,Forsendur!$C$7+2,1),\"Mmm\nyyy\"))","v":"Mar\n2016"},{"$f":"PROPER(TEXT(DATE(Forsendur!$C$6,Forsendur!$C$7+3,1),\"Mmm\nyyy\"))","v":"Apr\n2016"},{"$f":"PROPER(TEXT(DATE(Forsendur!$C$6,Forsendur!$C$7+4,1),\"Mmm\nyyy\"))","v":"Maí\n2016"},{"$f":"PROPER(TEXT(DATE(Forsendur!$C$6,Forsendur!$C$7+5,1),\"Mmm\nyyy\"))","v":"Jún\n2016"},{"$f":"PROPER(TEXT(DATE(Forsendur!$C$6,Forsendur!$C$7+6,1),\"Mmm\nyyy\"))","v":"Júl\n2016"},{"$f":"PROPER(TEXT(DATE(Forsendur!$C$6,Forsendur!$C$7+7,1),\"Mmm\nyyy\"))","v":"Ágú\n2016"},{"$f":"PROPER(TEXT(DATE(Forsendur!$C$6,Forsendur!$C$7+8,1),\"Mmm\nyyy\"))","v":"Sep\n2016"},{"$f":"PROPER(TEXT(DATE(Forsendur!$C$6,Forsendur!$C$7+9,1),\"Mmm\nyyy\"))","v":"Okt\n2016"},{"$f":"PROPER(TEXT(DATE(Forsendur!$C$6,Forsendur!$C$7+10,1),\"Mmm\nyyy\"))","v":"Nóv\n2016"},{"$f":"PROPER(TEXT(DATE(Forsendur!$C$6,Forsendur!$C$7+11,1),\"Mmm\nyyy\"))","v":"Des\n2016"},{"$f":"IF(Forsendur!$C$7=1,\"Árið\n\"&Forsendur!$C$6,\"Árið\n\"&Forsendur!$C$6&\"-\"&Forsendur!$C$6+1)","v":"Árið\n2016"},{"$f":"PROPER(TEXT(DATE(Forsendur!$C$6+1,Forsendur!$C$7,1),\"Mmm\nyyy\"))","v":"Jan\n2017"},{"$f":"PROPER(TEXT(DATE(Forsendur!$C$6+1,Forsendur!$C$7+1,1),\"Mmm\nyyy\"))","v":"Feb\n2017"},{"$f":"PROPER(TEXT(DATE(Forsendur!$C$6+1,Forsendur!$C$7+2,1),\"Mmm\nyyy\"))","v":"Mar\n2017"},{"$f":"PROPER(TEXT(DATE(Forsendur!$C$6+1,Forsendur!$C$7+3,1),\"Mmm\nyyy\"))","v":"Apr\n2017"},{"$f":"PROPER(TEXT(DATE(Forsendur!$C$6+1,Forsendur!$C$7+4,1),\"Mmm\nyyy\"))","v":"Maí\n2017"},{"$f":"PROPER(TEXT(DATE(Forsendur!$C$6+1,Forsendur!$C$7+5,1),\"Mmm\nyyy\"))","v":"Jún\n2017"},{"$f":"PROPER(TEXT(DATE(Forsendur!$C$6+1,Forsendur!$C$7+6,1),\"Mmm\nyyy\"))","v":"Júl\n2017"},{"$f":"PROPER(TEXT(DATE(Forsendur!$C$6+1,Forsendur!$C$7+7,1),\"Mmm\nyyy\"))","v":"Ágú\n2017"},{"$f":"PROPER(TEXT(DATE(Forsendur!$C$6+1,Forsendur!$C$7+8,1),\"Mmm\nyyy\"))","v":"Sep\n2017"},{"$f":"PROPER(TEXT(DATE(Forsendur!$C$6+1,Forsendur!$C$7+9,1),\"Mmm\nyyy\"))","v":"Okt\n2017"},{"$f":"PROPER(TEXT(DATE(Forsendur!$C$6+1,Forsendur!$C$7+10,1),\"Mmm\nyyy\"))","v":"Nóv\n2017"},{"$f":"PROPER(TEXT(DATE(Forsendur!$C$6+1,Forsendur!$C$7+11,1),\"Mmm\nyyy\"))","v":"Des\n2017"},{"$f":"IF(Forsendur!$C$7=1,\"Árið\n\"&Forsendur!$C$6+1,\"Árið\n\"&Forsendur!$C$6+1&\"-\"&Forsendur!$C$6+2)","v":"Árið\n2017"},{"$f":"IF(Forsendur!$C$7=1,\"Árið\n\"&Forsendur!$C$6+2,\"Árið\n\"&Forsendur!$C$6+2&\"-\"&Forsendur!$C$6+3)","v":"Árið\n2018"},{"$f":"IF(Forsendur!$C$7=1,\"Árið\n\"&Forsendur!$C$6+3,\"Árið\n\"&Forsendur!$C$6+3&\"-\"&Forsendur!$C$6+4)","v":"Árið\n2019"},{"$f":"IF(Forsendur!$C$7=1,\"Árið\n\"&Forsendur!$C$6+4,\"Árið\n\"&Forsendur!$C$6+4&\"-\"&Forsendur!$C$6+5)","v":"Árið\n2020"},{"$f":"IF(Forsendur!$C$7=1,\"Árið\n\"&Forsendur!$C$6+5,\"Árið\n\"&Forsendur!$C$6+5&\"-\"&Forsendur!$C$6+6)","v":"Árið\n2021"}]
[]
["EIGNIR"]
[]
["Eignarhlutir í öðrum félögum"]
[]
[null,"Breyting milli tímabila",null,null,null,null,null,null,null,null,null,null,null,null,null,null,null,null,null,{"$f":"SUM(H9:S9)","v":0},null,null,null,null,null,null,null,null,null,null,null,null,{"$f":"SUM(U9:AF9)","v":0}]
[null,"Bókfærð staða í lok tímabils",null,null,null,null,null,{"$f":"+G10+H9","v":0},{"$f":"+H10+I9","v":0},0,0,0,0,0,0,0,0,0,0,{"$f":"+S10","v":0},0,{"$f":"+U10+V9","v":0},0,0,0,0,0,0,0,0,0,0,{"$f":"+AF10","v":0},{"$f":"+AG10+AH9","v":0},{"$f":"+AH10+AI9","v":0},{"$f":"+AI10+AJ9","v":0}]
{"$rows_left_out":124}
{"sheet":"Arsreikningur","index":7,"n_rows":156,"n_cols":36,"rows_kept":156,"cut":false,"hidden":false,"merged":[[2,3,2,4],[45,3,45,4],[101,3,101,4],[147,3,147,4]]}
["Sktkröfur","Viðsksk","Ógrkostn",{"$f":"Forsendur!$C$5","v":"Nafn fyrirtækis"}]
[]
[null,null,null,"REKSTRARREIKNINGUR"]
[null,null,null,null,"Skýr.",{"$f":"IF(Forsendur!$C$7=1,\"Árið\n\"&Forsendur!$C$6-1,\"Árið\n\"&Forsendur!$C$6-1&\"-\"&Forsendur!$C$6)","v":"Árið\n2015"},null,{"$f":"Efnahagur!H3","v":"Jan\n2016"},{"$f":"Efnahagur!I3","v":"Feb\n2016"},{"$f":"Efnahagur!J3","v":"Mar\n2016"},{"$f":"Efnahagur!K3","v":"Apr\n2016"},{"$f":"Efnahagur!L3","v":"Maí\n2016"},{"$f":"Efnahagur!M3","v":"Jún\n2016"},{"$f":"Efnahagur!N3","v":"Júl\n2016"},{"$f":"Efnahagur!O3","v":"Ágú\n2016"},{"$f":"Efnahagur!P3","v":"Sep\n2016"},{"$f":"Efnahagur!Q3","v":"Okt\n2016"},{"$f":"Efnahagur!R3","v":"Nóv\n2016"},{"$f":"Efnahagur!S3","v":"Des\n2016"},{"$f":"Efnahagur!T3","v":"Árið\n2016"},{"$f":"Efnahagur!U3","v":"Jan\n2017"},{"$f":"Efnahagur!V3","v":"Feb\n2017"},{"$f":"Efnahagur!W3","v":"Mar\n2017"},{"$f":"Efnahagur!X3","v":"Apr\n2017"},{"$f":"Efnahagur!Y3","v":"Maí\n2017"},{"$f":"Efnahagur!Z3","v":"Jún\n2017"},{"$f":"Efnahagur!AA3","v":"Júl\n2017"},{"$f":"Efnahagur!AB3","v":"Ágú\n2017"},{"$f":"Efnahagur!AC3","v":"Sep\n2017"},{"$f":"Efnahagur!AD3","v":"Okt\n2017"},{"$f":"Efnahagur!AE3","v":"Nóv\n2017"},{"$f":"Efnahagur!AF3","v":"Des\n2017"},{"$f":"\"Árið \n\"&Forsendur!$C$6+1","v":"Árið \n2017"},{"$f":"\"Árið \n\"&Forsendur!$C$6+2","v":"Árið \n2018"},{"$f":"\"Árið \n\"&Forsendur!$C$6+3","v":"Árið \n2019"},{"$f":"\"Árið \n\"&Forsendur!$C$6+4","v":"Árið \n2020"}]
[null,null,null,"REKSTRARTEKJUR"]
[]
[null,null,null,{"$f":"+Rekstur!B7","v":"Tekjuliður no 1"},1,{"$f":"+Forsendur!D13","v":0},null,{"$f":"SUMIF(Rekstur!$C:$C,$E7,Rekstur!F:F)","v":0},{"$f":"SUMIF(Rekstur!$C:$C,$E7,Rekstur!G:G)","v":0},{"$f":"SUMIF(Rekstur!$C:$C,$E7,Rekstur!H:H)","v":0},{"$f":"SUMIF(Rekstur!$C:$C,$E7,Rekstur!I:I)","v":0},{"$f":"SUMIF(Rekstur!$C:$C,$E7,Rekstur!J:J)","v":0},{"$f":"SUMIF(Rekstur!$C:$C,$E7,Rekstur!K:K)","v":0},{"$f":"SUMIF(Rekstur!$C:$C,$E7,Rekstur!L:L)","v":0},{"$f":"SUMIF(Rekstur!$C:$C,$E7,Rekstur!M:M)","v":0},{"$f":"SUMIF(Rekstur!$C:$C,$E7,Rekstur!N:N)","v":0},{"$f":"SUMIF(Rekstur!$C:$C,$E7,Rekstur!O:O)","v":0},{"$f":"SUMIF(Rekstur!$C:$C,$E7,Rekstur!P:P)","v":0},{"$f":"SUMIF(Rekstur!$C:$C,$E7,Rekstur!Q:Q)","v":0},{"$f":"SUM(H7:S7)","v":0},{"$f":"SUMIF(Rekstur!$C:$C,$E7,Rekstur!S:S)","v":0},{"$f":"SUMIF(Rekstur!$C:$C,$E7,Rekstur!T:T)","v":0},{"$f":"SUMIF(Rekstur!$C:$C,$E7,Rekstur!U:U)","v":0},{"$f":"SUMIF(Rekstur!$C:$C,$E7,Rekstur!V:V)","v":0},{"$f":"SUMIF(Rekstur!$C:$C,$E7,Rekstur!W:W)","v":0},{"$f":"SUMIF(Rekstur!$C:$C,$E7,Rekstur!X:X)","v":0},{"$f":"SUMIF(Rekstur!$C:$C,$E7,Rekstur!Y:Y)","v":0},{"$f":"SUMIF(Rekstur!$C:$C,$E7,Rekstur!Z:Z)","v":0},{"$f":"SUMIF(Rekstur!$C:$C,$E7,Rekstur!AA:AA)","v":0},{"$f":"SUMIF(Rekstur!$C:$C,$E7,Rekstur!AB:AB)","v":0},{"$f":"SUMIF(Rekstur!$C:$C,$E7,Rekstur!AC:AC)","v":0},{"$f":"SUMIF(Rekstur!$C:$C,$E7,Rekstur!AD:AD)","v":0},{"$f":"SUM(U7:AF7)","v":0},{"$f":"SUMIF(Rekstur!$C:$C,$E7,Rekstur!AF:AF)","v":0},{"$f":"SUMIF(Rekstur!$C:$C,$E7,Rekstur!AG:AG)","v":0},{"$f":"SUMIF(Rekstur!$C:$C,$E7,Rekstur!AH:AH)","v":0}]
[null,null,null,{"$f":"+Rekstur!B21","v":"Tekjuliður no 2"},2,{"$f":"+Forsendur!D14","v":0},null,{"$f":"SUMIF(Rekstur!$C:$C,$E8,Rekstur!F:F)","v":0},{"$f":"SUMIF(Rekstur!$C:$C,$E8,Rekstur!G:G)","v":0},{"$f":"SUMIF(Rekstur!$C:$C,$E8,Rekstur!H:H)","v":0},{"$f":"SUMIF(Rekstur!$C:$C,$E8,Rekstur!I:I)","v":0},{"$f":"SUMIF(Rekstur!$C:$C,$E8,Rekstur!J:J)","v":0},{"$f":"SUMIF(Rekstur!$C:$C,$E8,Rekstur!K:K)","v":0},{"$f":"SUMIF(Rekstur!$C:$C,$E8,Rekstur!L:L)","v":0},{"$f":"SUMIF(Rekstur!$C:$C,$E8,Rekstur!M:M)","v":0},{"$f":"SUMIF(Rekstur!$C:$C,$E8,Rekstur!N:N)","v":0},{"$f":"SUMIF(Rekstur!$C:$C,$E8,Rekstur!O:O)","v":0},{"$f":"SUMIF(Rekstur!$C:$C,$E8,Rekstur!P:P)","v":0},{"$f":"SUMIF(Rekstur!$C:$C,$E8,Rekstur!Q:Q)","v":0},{"$f":"SUM(H8:S8)","v":0},{"$f":"SUMIF(Rekstur!$C:$C,$E8,Rekstur!S:S)","v":0},{"$f":"SUMIF(Rekstur!$C:$C,$E8,Rekstur!T:T)","v":0},{"$f":"SUMIF(Rekstur!$C:$C,$E8,Rekstur!U:U)","v":0},{"$f":"SUMIF(Rekstur!$C:$C,$E8,Rekstur!V:V)","v":0},{"$f":"SUMIF(Rekstur!$C:$C,$E8,Rekstur!W:W)","v":0},{"$f":"SUMIF(Rekstur!$C:$C,$E8,Rekstur!X:X)","v":0},{"$f":"SUMIF(Rekstur!$C:$C,$E8,Rekstur!Y:Y)","v":0},{"$f":"SUMIF(Rekstur!$C:$C,$E8,Rekstur!Z:Z)","v":0},{"$f":"SUMIF(Rekstur!$C:$C,$E8,Rekstur!AA:AA)","v":0},{"$f":"SUMIF(Rekstur!$C:$C,$E8,Rekstur!AB:AB)","v":0},{"$f":"SUMIF(Rekstur!$C:$C,$E8,Rekstur!AC:AC)","v":0},{"$f":"SUMIF(Rekstur!$C:$C,$E8,Rekstur!AD:AD)","v":0},{"$f":"SUM(U8:AF8)","v":0},{"$f":"SUMIF(Rekstur!$C:$C,$E8,Rekstur!AF:AF)","v":0},{"$f":"SUMIF(Rekstur!$C:$C,$E8,Rekstur!AG:AG)","v":0},{"$f":"SUMIF(Rekstur!$C:$C,$E8,Rekstur!AH:AH)","v":0}]
[null,null,null,{"$f":"+Rekstur!B35","v":"Tekjuliður no 3"},3,{"$f":"+Forsendur!D15","v":0},null,{"$f":"SUMIF(Rekstur!$C:$C,$E9,Rekstur!F:F)","v":0},{"$f":"SUMIF(Rekstur!$C:$C,$E9,Rekstur!G:G)","v":0},{"$f":"SUMIF(Rekstur!$C:$C,$E9,Rekstur!H:H)","v":0},{"$f":"SUMIF(Rekstur!$C:$C,$E9,Rekstur!I:I)","v":0},{"$f":"SUMIF(Rekstur!$C:$C,$E9,Rekstur!J:J)","v":0},{"$f":"SUMIF(Rekstur!$C:$C,$E9,Rekstur!K:K)","v":0},{"$f":"SUMIF(Rekstur!$C:$C,$E9,Rekstur!L:L)","v":0},{"$f":"SUMIF(Rekstur!$C:$C,$E9,Rekstur!M:M)","v":0},{"$f":"SUMIF(Rekstur!$C:$C,$E9,Rekstur!N:N)","v":0},{"$f":"SUMIF(Rekstur!$C:$C,$E9,Rekstur!O:O)","v":0},{"$f":"SUMIF(Rekstur!$C:$C,$E9,Rekstur!P:P)","v":0},{"$f":"SUMIF(Rekstur!$C:$C,$E9,Rekstur!Q:Q)","v":0},{"$f":"SUM(H9:S9)","v":0},{"$f":"SUMIF(Rekstur!$C:$C,$E9,Rekstur!S:S)","v":0},{"$f":"SUMIF(Rekstur!$C:$C,$E9,Rekstur!T:T)","v":0},{"$f":"SUMIF(Rekstur!$C:$C,$E9,Rekstur!U:U)","v":0},{"$f":"SUMIF(Rekstur!$C:$C,$E9,Rekstur!V:V)","v":0},{"$f":"SUMIF(Rekstur!$C:$C,$E9,Rekstur!W:W)","v":0},{"$f":"SUMIF(Rekstur!$C:$C,$E9,Rekstur!X:X)","v":0},{"$f":"SUMIF(Rekstur!$C:$C,$E9,Rekstur!Y:Y)","v":0},{"$f":"SUMIF(Rekstur!$C:$C,$E9,Rekstur!Z:Z)","v":0},{"$f":"SUMIF(Rekstur!$C:$C,$E9,Rekstur!AA:AA)","v":0},{"$f":"SUMIF(Rekstur!$C:$C,$E9,Rekstur!AB:AB)","v":0},{"$f":"SUMIF(Rekstur!$C:$C,$E9,Rekstur!AC:AC)","v":0},{"$f":"SUMIF(Rekstur!$C:$C,$E9,Rekstur!AD:AD)","v":0},{"$f":"SUM(U9:AF9)","v":0},{"$f":"SUMIF(Rekstur!$C:$C,$E9,Rekstur!AF:AF)","v":0},{"$f":"SUMIF(Rekstur!$C:$C,$E9,Rekstur!AG:AG)","v":0},{"$f":"SUMIF(Rekstur!$C:$C,$E9,Rekstur!AH:AH)","v":0}]
[null,null,null,{"$f":"+Rekstur!B49","v":"Tekjuliður no 4"},4,{"$f":"+Forsendur!D16","v":0},null,{"$f":"SUMIF(Rekstur!$C:$C,$E10,Rekstur!F:F)","v":0},{"$f":"SUMIF(Rekstur!$C:$C,$E10,Rekstur!G:G)","v":0},{"$f":"SUMIF(Rekstur!$C:$C,$E10,Rekstur!H:H)","v":0},{"$f":"SUMIF(Rekstur!$C:$C,$E10,Rekstur!I:I)","v":0},{"$f":"SUMIF(Rekstur!$C:$C,$E10,Rekstur!J:J)","v":0},{"$f":"SUMIF(Rekstur!$C:$C,$E10,Rekstur!K:K)","v":0},{"$f":"SUMIF(Rekstur!$C:$C,$E10,Rekstur!L:L)","v":0},{"$f":"SUMIF(Rekstur!$C:$C,$E10,Rekstur!M:M)","v":0},{"$f":"SUMIF(Rekstur!$C:$C,$E10,Rekstur!N:N)","v":0},{"$f":"SUMIF(Rekstur!$C:$C,$E10,Rekstur!O:O)","v":0},{"$f":"SUMIF(Rekstur!$C:$C,$E10,Rekstur!P:P)","v":0},{"$f":"SUMIF(Rekstur!$C:$C,$E10,Rekstur!Q:Q)","v":0},{"$f":"SUM(H10:S10)","v":0},{"$f":"SUMIF(Rekstur!$C:$C,$E10,Rekstur!S:S)","v":0},{"$f":"SUMIF(Rekstur!$C:$C,$E10,Rekstur!T:T)","v":0},{"$f":"SUMIF(Rekstur!$C:$C,$E10,Rekstur!U:U)","v":0},{"$f":"SUMIF(Rekstur!$C:$C,$E10,Rekstur!V:V)","v":0},{"$f":"SUMIF(Rekstur!$C:$C,$E10,Rekstur!W:W)","v":0},{"$f":"SUMIF(Rekstur!$C:$C,$E10,Rekstur!X:X)","v":0},{"$f":"SUMIF(Rekstur!$C:$C,$E10,Rekstur!Y:Y)","v":0},{"$f":"SUMIF(Rekstur!$C:$C,$E10,Rekstur!Z:Z)","v":0},{"$f":"SUMIF(Rekstur!$C:$C,$E10,Rekstur!AA:AA)","v":0},{"$f":"SUMIF(Rekstur!$C:$C,$E10,Rekstur!AB:AB)","v":0},{"$f":"SUMIF(Rekstur!$C:$C,$E10,Rekstur!AC:AC)","v":0},{"$f":"SUMIF(Rekstur!$C:$C,$E10,Rekstur!AD:AD)","v":0},{"$f":"SUM(U10:AF10)","v":0},{"$f":"SUMIF(Rekstur!$C:$C,$E10,Rekstur!AF:AF)","v":0},{"$f":"SUMIF(Rekstur!$C:$C,$E10,Rekstur!AG:AG)","v":0},{"$f":"SUMIF(Rekstur!$C:$C,$E10,Rekstur!AH:AH)","v":0}]
{"$rows_left_out":147}
{"sheet":"Naemi","index":8,"n_rows":62,"n_cols":12,"rows_kept":62,"cut":false,"hidden":false,"merged":[[55,2,61,2],[2,0,2,1],[19,0,19,1],[46,0,46,1]]}
[{"$f":"Forsendur!$C$5","v":"Nafn fyrirtækis"}]
[]
["FORSENDUR NÆMISGREININGAR"]
[]
[null,null,"Virkt (1)/\nÓvirkt (0)"]
["TEKJUR"]
[null,{"$f":"Rekstur!B7","v":"Tekjuliður no 1"},1]
[null,{"$f":"Rekstur!B21","v":"Tekjuliður no 2"},1]
[null,{"$f":"Rekstur!B35","v":"Tekjuliður no 3"},1]
[null,{"$f":"Rekstur!B49","v":"Tekjuliður no 4"},1]
{"$rows_left_out":53}
{"sheet":"Verdmat","index":9,"n_rows":67,"n_cols":11,"rows_kept":67,"cut":false,"hidden":false,"merged":[[60,2,66,2],[2,0,2,1],[10,0,10,1],[39,0,39,1],[55,0,55,1]]}
[{"$f":"Forsendur!$C$5","v":"Nafn fyrirtækis"}]
[]
["Til athugunar"]
[]
[]
[]
[]
[]
[]
[]
{"$rows_left_out":58}
{"sheet":"Myndir","index":10,"n_rows":84,"n_cols":11,"rows_kept":84,"cut":false,"hidden":false,"merged":[[2,0,2,1],[24,0,24,1],[46,0,46,1],[72,0,72,1]]}
[{"$f":"Forsendur!$C$5","v":"Nafn fyrirtækis"}]
[]
["Rekstrartekjur og hagnaður í millj. kr."]
[]
[]
[]
[]
[]
[]
[]
{"$rows_left_out":74}